Reaction Details
TargetDeoxyribonuclease-1
LigandBDBM50157832
Substrate/Competitorn/a
Meas. Tech.ChEMBL_1517027 (CHEMBL3619486)
IC50>100000±n/a nM
Citation Chapman, TMWallace, CGillen, KJBakrania, PKhurana, PCoombs, PJFox, SBureau, EABrownlees, JMelton, DWSaxty, B N-Hydroxyimides and hydroxypyrimidinones as inhibitors of the DNA repair complex ERCC1-XPF. Bioorg Med Chem Lett25:4104-8 (2015) 
 
Deoxyribonuclease-1
Name:Deoxyribonuclease-1
Type:PROTEIN
Mol. Mass.:31422.78
Organism:Homo sapiens (Human)
Description:ChEMBL_109543
Residue:282
BDBM50157832
NameBDBM50157832
Synonyms:3-Hydroxy-4a,7a-dihydro-1H-thieno[2,3-d]pyrimidine-2,4-dione | CHEMBL361350
TypeSmall organic molecule
Emp. Form.C6H4N2O3S
Mol. Mass.184.173
SMILESOn1c(=O)[nH]c2sccc2c1=O