Reaction Details
TargetDeoxyribonuclease-1
LigandBDBM50121867
Substrate/Competitorn/a
Meas. Tech.ChEMBL_1517027 (CHEMBL3619486)
IC50 30200±n/a nM
Citation Chapman, TMWallace, CGillen, KJBakrania, PKhurana, PCoombs, PJFox, SBureau, EABrownlees, JMelton, DWSaxty, B N-Hydroxyimides and hydroxypyrimidinones as inhibitors of the DNA repair complex ERCC1-XPF. Bioorg Med Chem Lett25:4104-8 (2015) 
 
Deoxyribonuclease-1
Name:Deoxyribonuclease-1
Type:PROTEIN
Mol. Mass.:31422.78
Organism:Homo sapiens (Human)
Description:ChEMBL_109543
Residue:282
BDBM50121867
NameBDBM50121867
Synonyms:CHEMBL3617197
TypeSmall organic molecule
Emp. Form.C14H11N3O3
Mol. Mass.269.2554
SMILESOn1c(=O)[nH]c2cc(Nc3ccccc3)ccc2c1=O