Reaction Details
TargetDeoxyribonuclease-1
LigandBDBM50121863
Substrate/Competitorn/a
Meas. Tech.ChEMBL_1517027 (CHEMBL3619486)
IC50 87000±n/a nM
Citation Chapman, TMWallace, CGillen, KJBakrania, PKhurana, PCoombs, PJFox, SBureau, EABrownlees, JMelton, DWSaxty, B N-Hydroxyimides and hydroxypyrimidinones as inhibitors of the DNA repair complex ERCC1-XPF. Bioorg Med Chem Lett25:4104-8 (2015) 
 
Deoxyribonuclease-1
Name:Deoxyribonuclease-1
Type:PROTEIN
Mol. Mass.:31422.78
Organism:Homo sapiens (Human)
Description:ChEMBL_109543
Residue:282
BDBM50121863
NameBDBM50121863
Synonyms:CHEMBL3617201
TypeSmall organic molecule
Emp. Form.C10H9N3O4
Mol. Mass.235.1962
SMILESCC(=O)Nc1ccc2[nH]c(=O)n(O)c(=O)c2c1