Reaction Details
TargetDeoxyribonuclease-1
LigandBDBM50121876
Substrate/Competitorn/a
Meas. Tech.ChEMBL_1517027 (CHEMBL3619486)
IC50>100000±n/a nM
Citation Chapman, TMWallace, CGillen, KJBakrania, PKhurana, PCoombs, PJFox, SBureau, EABrownlees, JMelton, DWSaxty, B N-Hydroxyimides and hydroxypyrimidinones as inhibitors of the DNA repair complex ERCC1-XPF. Bioorg Med Chem Lett25:4104-8 (2015) 
 
Deoxyribonuclease-1
Name:Deoxyribonuclease-1
Type:PROTEIN
Mol. Mass.:31422.78
Organism:Homo sapiens (Human)
Description:ChEMBL_109543
Residue:282
BDBM50121876
NameBDBM50121876
Synonyms:CHEMBL3617209
TypeSmall organic molecule
Emp. Form.C13H15N3O3S
Mol. Mass.293.342
SMILESCCC(C)NC(=O)c1nc([nH]c(=O)c1O)-c1cccs1