Reaction Details
TargetDeoxyribonuclease-1
LigandBDBM50121880
Substrate/Competitorn/a
Meas. Tech.ChEMBL_1517027 (CHEMBL3619486)
IC50>100000±n/a nM
Citation Chapman, TMWallace, CGillen, KJBakrania, PKhurana, PCoombs, PJFox, SBureau, EABrownlees, JMelton, DWSaxty, B N-Hydroxyimides and hydroxypyrimidinones as inhibitors of the DNA repair complex ERCC1-XPF. Bioorg Med Chem Lett25:4104-8 (2015) 
 
Deoxyribonuclease-1
Name:Deoxyribonuclease-1
Type:PROTEIN
Mol. Mass.:31422.78
Organism:Homo sapiens (Human)
Description:ChEMBL_109543
Residue:282
BDBM50121880
NameBDBM50121880
Synonyms:CHEMBL216874
TypeSmall organic molecule
Emp. Form.C16H12FN3O3S
Mol. Mass.345.348
SMILESOc1nc(nc(C(=O)NCc2ccc(F)cc2)c1O)-c1cccs1