Reaction Details
TargetDeath-associated protein kinase 1
LigandBDBM50121994
Substrate/Competitorn/a
Meas. Tech.ChEMBL_1517176 (CHEMBL3620066)
IC50 220000±n/a nM
Citation Yokoyama, TKosaka, YMizuguchi, M Structural Insight into the Interactions between Death-Associated Protein Kinase 1 and Natural Flavonoids. J Med Chem58:7400-8 (2015) 
 
Death-associated protein kinase 1
Name:Death-associated protein kinase 1
Type:PROTEIN
Mol. Mass.:160053.35
Organism:Homo sapiens (Human)
Description:ChEMBL_1517177
Residue:1430
BDBM50121994
NameBDBM50121994
Synonyms:CHEBI:25863 | Pelargonidin
TypeSmall organic molecule
Emp. Form.C15H11O5
Mol. Mass.271.2443
SMILESOc1ccc(cc1)-c1[o+]c2cc(O)cc(O)c2cc1O