Reaction Details
TargetDeath-associated protein kinase 1
LigandBDBM50095997
Substrate/Competitorn/a
Meas. Tech.ChEMBL_1517176 (CHEMBL3620066)
IC50 280000±n/a nM
Citation Yokoyama, TKosaka, YMizuguchi, M Structural Insight into the Interactions between Death-Associated Protein Kinase 1 and Natural Flavonoids. J Med Chem58:7400-8 (2015) 
 
Death-associated protein kinase 1
Name:Death-associated protein kinase 1
Type:PROTEIN
Mol. Mass.:160053.35
Organism:Homo sapiens (Human)
Description:ChEMBL_1517177
Residue:1430
BDBM50095997
NameBDBM50095997
Synonyms:3',4',7-trihydroxyisoflavone | CHEMBL13486
TypeSmall organic molecule
Emp. Form.C15H10O5
Mol. Mass.270.2369
SMILESOc1ccc2c(c1)occ(-c1ccc(O)c(O)c1)c2=O