Reaction Details
TargetD-aspartate oxidase
LigandBDBM50052793
Substrate/Competitorn/a
Meas. Tech.ChEMBL_1517179 (CHEMBL3620069)
IC50 2364000±n/a nM
Citation Katane, MYamada, SKawaguchi, GChinen, MMatsumura, MAndo, TDoi, INakayama, KKaneko, YMatsuda, SSaitoh, YMiyamoto, TSekine, MYamaotsu, NHirono, SHomma, H Identification of Novel D-Aspartate Oxidase Inhibitors by in Silico Screening and Their Functional and Structural Characterization in Vitro. J Med Chem58:7328-40 (2015) 
 
D-aspartate oxidase
Name:D-aspartate oxidase
Type:Oxidoreductase
Mol. Mass.:37543.06
Organism:Homo sapiens (Human)
Description:Recombinant human DDO expressed and purified from sf9 insect cells, was used in enzyme assays.
Residue:341
BDBM50052793
NameBDBM50052793
Synonyms:CHEBI:68583 | CHEMBL3322864
TypeSmall organic molecule
Emp. Form.C6H6N2O2
Mol. Mass.138.124
SMILESNc1ccc(cn1)C(O)=O