Reaction Details
TargetD-aspartate oxidase
LigandBDBM50240969
Substrate/Competitorn/a
Meas. Tech.ChEMBL_1517179 (CHEMBL3620069)
IC50>10000000±n/a nM
Citation Katane, MYamada, SKawaguchi, GChinen, MMatsumura, MAndo, TDoi, INakayama, KKaneko, YMatsuda, SSaitoh, YMiyamoto, TSekine, MYamaotsu, NHirono, SHomma, H Identification of Novel D-Aspartate Oxidase Inhibitors by in Silico Screening and Their Functional and Structural Characterization in Vitro. J Med Chem58:7328-40 (2015) 
 
D-aspartate oxidase
Name:D-aspartate oxidase
Type:Oxidoreductase
Mol. Mass.:37543.06
Organism:Homo sapiens (Human)
Description:Recombinant human DDO expressed and purified from sf9 insect cells, was used in enzyme assays.
Residue:341
BDBM50240969
NameBDBM50240969
Synonyms:5-Chloro-2-hydroxy-benzoic acid CHEMBL1375
TypeSmall organic molecule
Emp. Form.C7H5ClO3
Mol. Mass.172.566
SMILESOC(=O)c1cc(Cl)ccc1O