Reaction Details
TargetMu-type opioid receptor
LigandBDBM50122060
Substrate/Competitorn/a
Meas. Tech.ChEMBL_1517221 (CHEMBL3620205)
Ki 3.0±n/a nM
Citation Deekonda, SWugalter, LRankin, DLargent-Milnes, TMDavis, PWang, YBassirirad, NMLai, JKulkarni, VVanderah, TWPorreca, FHruby, VJ Design and synthesis of novel bivalent ligands (MOR and DOR) by conjugation of enkephalin analogues with 4-anilidopiperidine derivatives. Bioorg Med Chem Lett25:4683-8 (2015) 
 
Mu-type opioid receptor
Name:Mu-type opioid receptor
Type:G Protein-Coupled Receptor (GPCR)
Mol. Mass.:44503.11
Organism:Rattus norvegicus (rat)
Description:Competition binding assays were carried out using membrane preparations from transfected HN9.10 cells that constitutively expressed the mu opioid receptor.
Residue:398
BDBM50122060
NameBDBM50122060
Synonyms:CHEMBL3617469
TypeSmall organic molecule
Emp. Form.C48H59N7O6
Mol. Mass.830.0254
SMILESCCC(=O)N(C1CCN(Cc2ccc3[C@@H](CCCc3c2)NC(=O)[C@H](Cc2ccccc2)NC(=O)CNC(=O)[C@@H](C)NC(=O)[C@@H](N)Cc2ccc(O)cc2)CC1)c1ccccc1