Reaction Details
TargetMetabotropic glutamate receptor 3
LigandBDBM50122269
Substrate/Competitorn/a
Meas. Tech.ChEMBL_1517378 (CHEMBL3620959)
IC50 186±n/a nM
Citation Engers, JLRodriguez, ALKonkol, LCMorrison, RDThompson, ADByers, FWBlobaum, ALChang, SVenable, DFLoch, MTNiswender, CMDaniels, JSJones, CKConn, PJLindsley, CWEmmitte, KA Discovery of a Selective and CNS Penetrant Negative Allosteric Modulator of Metabotropic Glutamate Receptor Subtype 3 with Antidepressant and Anxiolytic Activity in Rodents. J Med Chem58:7485-500 (2015) 
 
Metabotropic glutamate receptor 3
Name:Metabotropic glutamate receptor 3
Type:Protein
Mol. Mass.:98971.84
Organism:Rattus norvegicus (Rat)
Description:P31422
Residue:879
BDBM50122269
NameBDBM50122269
Synonyms:CHEMBL3617623
TypeSmall organic molecule
Emp. Form.C19H15F3N4O2
Mol. Mass.388.3432
SMILESC[C@@H]1CN(C(=O)c2cc(COc3ccc(F)cn3)nn12)c1cccc(F)c1F