Reaction Details
TargetMetabotropic glutamate receptor 3
LigandBDBM50122240
Substrate/Competitorn/a
Meas. Tech.ChEMBL_1517378 (CHEMBL3620959)
IC50 328±n/a nM
Citation Engers, JLRodriguez, ALKonkol, LCMorrison, RDThompson, ADByers, FWBlobaum, ALChang, SVenable, DFLoch, MTNiswender, CMDaniels, JSJones, CKConn, PJLindsley, CWEmmitte, KA Discovery of a Selective and CNS Penetrant Negative Allosteric Modulator of Metabotropic Glutamate Receptor Subtype 3 with Antidepressant and Anxiolytic Activity in Rodents. J Med Chem58:7485-500 (2015) 
 
Metabotropic glutamate receptor 3
Name:Metabotropic glutamate receptor 3
Type:Protein
Mol. Mass.:98971.84
Organism:Rattus norvegicus (Rat)
Description:P31422
Residue:879
BDBM50122240
NameBDBM50122240
Synonyms:CHEMBL3617650
TypeSmall organic molecule
Emp. Form.C18H16ClN5O2
Mol. Mass.369.805
SMILESC[C@@H]1CN(C(=O)c2cc(COc3ccc(Cl)cn3)nn12)c1ccccn1