Reaction Details
TargetNon-receptor tyrosine-protein kinase TYK2
LigandBDBM50122319
Substrate/Competitorn/a
Meas. Tech.ChEMBL_1518842 (CHEMBL3625648)
IC50 1.9±n/a nM
Citation Wan, HSchroeder, GMHart, ACInghrim, JGrebinski, JTokarski, JSLorenzi, MVYou, DMcdevitt, TPenhallow, BVuppugalla, RZhang, YGu, XIyer, RLombardo, LJTrainor, GLRuepp, SLippy, JBlat, YSack, JSKhan, JAStefanski, KSleczka, BMathur, ASun, JHWong, MKWu, DRLi, PGupta, AArunachalam, PNPragalathan, BNarayanan, SK C, NKuppusamy, PPurandare, AV Discovery of a Highly Selective JAK2 Inhibitor, BMS-911543, for the Treatment of Myeloproliferative Neoplasms. ACS Med Chem Lett6:850-5 (2015) 
 
Non-receptor tyrosine-protein kinase TYK2
Name:Non-receptor tyrosine-protein kinase TYK2
Type:Protein
Mol. Mass.:133666.03
Organism:Homo sapiens (Human)
Description:P29597
Residue:1187
BDBM50122319
NameBDBM50122319
Synonyms:CHEMBL3622150
TypeSmall organic molecule
Emp. Form.C22H26N8O
Mol. Mass.418.4948
SMILESCCn1c(cc2c1nc(Nc1cc(C)[nH]n1)c1ncn(C)c21)C(=O)N(C1CC1)C1CC1