Reaction Details
TargetTyrosine-protein kinase JAK2
LigandBDBM50122320
Substrate/Competitorn/a
Meas. Tech.ChEMBL_1518838 (CHEMBL3625512)
IC50 230±n/a nM
Citation Wan, HSchroeder, GMHart, ACInghrim, JGrebinski, JTokarski, JSLorenzi, MVYou, DMcdevitt, TPenhallow, BVuppugalla, RZhang, YGu, XIyer, RLombardo, LJTrainor, GLRuepp, SLippy, JBlat, YSack, JSKhan, JAStefanski, KSleczka, BMathur, ASun, JHWong, MKWu, DRLi, PGupta, AArunachalam, PNPragalathan, BNarayanan, SK C, NKuppusamy, PPurandare, AV Discovery of a Highly Selective JAK2 Inhibitor, BMS-911543, for the Treatment of Myeloproliferative Neoplasms. ACS Med Chem Lett6:850-5 (2015) 
 
Tyrosine-protein kinase JAK2
Name:Tyrosine-protein kinase JAK2
Type:Protein
Mol. Mass.:130684.68
Organism:Homo sapiens (Human)
Description:O60674
Residue:1132
BDBM50122320
NameBDBM50122320
Synonyms:CHEMBL3622149
TypeSmall organic molecule
Emp. Form.C23H28N8O
Mol. Mass.432.5214
SMILESCCn1c(cc2c1nc(Nc1cc(C)nn1C)c1ncn(C)c21)C(=O)N(C1CC1)C1CC1