Reaction Details
TargetTyrosine-protein kinase JAK3
LigandBDBM50122321
Substrate/Competitorn/a
Meas. Tech.ChEMBL_1518840 (CHEMBL3625646)
IC50 210±n/a nM
Citation Wan, HSchroeder, GMHart, ACInghrim, JGrebinski, JTokarski, JSLorenzi, MVYou, DMcdevitt, TPenhallow, BVuppugalla, RZhang, YGu, XIyer, RLombardo, LJTrainor, GLRuepp, SLippy, JBlat, YSack, JSKhan, JAStefanski, KSleczka, BMathur, ASun, JHWong, MKWu, DRLi, PGupta, AArunachalam, PNPragalathan, BNarayanan, SK C, NKuppusamy, PPurandare, AV Discovery of a Highly Selective JAK2 Inhibitor, BMS-911543, for the Treatment of Myeloproliferative Neoplasms. ACS Med Chem Lett6:850-5 (2015) 
 
Tyrosine-protein kinase JAK3
Name:Tyrosine-protein kinase JAK3
Type:Protein
Mol. Mass.:125111.08
Organism:Homo sapiens (Human)
Description:P52333
Residue:1124
BDBM50122321
NameBDBM50122321
Synonyms:CHEMBL3622148
TypeSmall organic molecule
Emp. Form.C24H30N8O
Mol. Mass.446.548
SMILESCCn1nc(Nc2nc3n(CC)c(cc3c3n(C)cnc23)C(=O)N(C2CC2)C2CC2)cc1C