Reaction Details
TargetTyrosine-protein kinase JAK1
LigandBDBM50122323
Substrate/Competitorn/a
Meas. Tech.ChEMBL_1518839 (CHEMBL3625645)
IC50 48±n/a nM
Citation Wan, HSchroeder, GMHart, ACInghrim, JGrebinski, JTokarski, JSLorenzi, MVYou, DMcdevitt, TPenhallow, BVuppugalla, RZhang, YGu, XIyer, RLombardo, LJTrainor, GLRuepp, SLippy, JBlat, YSack, JSKhan, JAStefanski, KSleczka, BMathur, ASun, JHWong, MKWu, DRLi, PGupta, AArunachalam, PNPragalathan, BNarayanan, SK C, NKuppusamy, PPurandare, AV Discovery of a Highly Selective JAK2 Inhibitor, BMS-911543, for the Treatment of Myeloproliferative Neoplasms. ACS Med Chem Lett6:850-5 (2015) 
 
Tyrosine-protein kinase JAK1
Name:Tyrosine-protein kinase JAK1
Type:Protein
Mol. Mass.:133293.73
Organism:Homo sapiens (Human)
Description:P23458
Residue:1154
BDBM50122323
NameBDBM50122323
Synonyms:CHEMBL3622146
TypeSmall organic molecule
Emp. Form.C27H32N8O4S2
Mol. Mass.596.724
SMILESCCn1c(cc2c1nc(Nc1nc(C)c(s1)C(=O)N1CCS(=O)(=O)CC1)c1ncn(C)c21)C(=O)N(C1CC1)C1CC1