Reaction Details
TargetA disintegrin and metalloproteinase with thrombospondin motifs 4
LigandBDBM50122450
Substrate/Competitorn/a
Meas. Tech.ChEMBL_1519714 (CHEMBL3624059)
IC50 63±n/a nM
Citation Ding, YO'Keefe, HDeLorey, JLIsrael, DIMesser, JAChiu, CHSkinner, SRMatico, REMurray-Thompson, MFLi, FClark, MACuozzo, JWArico-Muendel, CMorgan, BA Discovery of Potent and Selective Inhibitors for ADAMTS-4 through DNA-Encoded Library Technology (ELT). ACS Med Chem Lett6:888-93 (2015) 
 
A disintegrin and metalloproteinase with thrombospondin motifs 4
Name:A disintegrin and metalloproteinase with thrombospondin motifs 4
Type:Enzyme
Mol. Mass.:90214.54
Organism:Homo sapiens (Human)
Description:O75173
Residue:837
BDBM50122450
NameBDBM50122450
Synonyms:CHEMBL3622493
TypeSmall organic molecule
Emp. Form.C29H30N6O
Mol. Mass.478.5881
SMILESCCN(C(=O)c1ccc(CNc2ncnc(n2)N2CCc3ccccc3C2)cc1)c1cccc(C)c1