Reaction Details
TargetA disintegrin and metalloproteinase with thrombospondin motifs 4
LigandBDBM50122457
Substrate/Competitorn/a
Meas. Tech.ChEMBL_1519714 (CHEMBL3624059)
IC50 163±n/a nM
Citation Ding, YO'Keefe, HDeLorey, JLIsrael, DIMesser, JAChiu, CHSkinner, SRMatico, REMurray-Thompson, MFLi, FClark, MACuozzo, JWArico-Muendel, CMorgan, BA Discovery of Potent and Selective Inhibitors for ADAMTS-4 through DNA-Encoded Library Technology (ELT). ACS Med Chem Lett6:888-93 (2015) 
 
A disintegrin and metalloproteinase with thrombospondin motifs 4
Name:A disintegrin and metalloproteinase with thrombospondin motifs 4
Type:Enzyme
Mol. Mass.:90214.54
Organism:Homo sapiens (Human)
Description:O75173
Residue:837
BDBM50122457
NameBDBM50122457
Synonyms:CHEMBL3622486
TypeSmall organic molecule
Emp. Form.C37H41N7O4
Mol. Mass.647.7659
SMILESCCN(C(=O)c1ccc(CNc2nc(NCCc3ccco3)nc(n2)N2CCc3cc(OC)c(OC)cc3C2)cc1)c1cccc(C)c1