Reaction Details
TargetA disintegrin and metalloproteinase with thrombospondin motifs 4
LigandBDBM50122501
Substrate/Competitorn/a
Meas. Tech.ChEMBL_1519714 (CHEMBL3624059)
IC50 3000±n/a nM
Citation Ding, YO'Keefe, HDeLorey, JLIsrael, DIMesser, JAChiu, CHSkinner, SRMatico, REMurray-Thompson, MFLi, FClark, MACuozzo, JWArico-Muendel, CMorgan, BA Discovery of Potent and Selective Inhibitors for ADAMTS-4 through DNA-Encoded Library Technology (ELT). ACS Med Chem Lett6:888-93 (2015) 
 
A disintegrin and metalloproteinase with thrombospondin motifs 4
Name:A disintegrin and metalloproteinase with thrombospondin motifs 4
Type:Enzyme
Mol. Mass.:90214.54
Organism:Homo sapiens (Human)
Description:O75173
Residue:837
BDBM50122501
NameBDBM50122501
Synonyms:CHEMBL3622502
TypeSmall organic molecule
Emp. Form.C28H38N8O2
Mol. Mass.518.6537
SMILESCOc1cc2CCN(Cc2cc1OC)c1nc(NCCN2CCN(C)CC2)nc(NCc2ccccc2)n1