Reaction Details
TargetAndrogen receptor
LigandBDBM50122644
Substrate/Competitorn/a
Meas. Tech.ChEMBL_1519754 (CHEMBL3624233)
Ki 12±n/a nM
Citation Balog, ARampulla, RMartin, GSKrystek, SRAttar, RDell-John, JDiMarco, JDFairfax, DGougoutas, JHolst, CLNation, ARizzo, CRossiter, LMSchweizer, LShan, WSpergel, SSpires, TCornelius, GGottardis, MTrainor, GVite, GDSalvati, ME Discovery of BMS-641988, a Novel Androgen Receptor Antagonist for the Treatment of Prostate Cancer. ACS Med Chem Lett6:908-12 (2015) 
 
Androgen receptor
Name:Androgen receptor
Type:Receptor
Mol. Mass.:99185.27
Organism:Homo sapiens (Human)
Description:CHO cells were stably transfected with human AR gene.
Residue:920
BDBM50122644
NameBDBM50122644
Synonyms:CHEMBL3623123
TypeSmall organic molecule
Emp. Form.C19H18F3N3O5S
Mol. Mass.457.424
SMILES[H][C@]12C(=O)N(C(=O)[C@@]1([H])[C@@]1(C)O[C@]2(C)C[C@H]1NS(C)(=O)=O)c1ccc(C#N)c(c1)C(F)(F)F