Reaction Details
TargetMitogen-activated protein kinase kinase kinase kinase 4
LigandBDBM50122688
Substrate/Competitorn/a
Meas. Tech.ChEMBL_1519919 (CHEMBL3624922)
IC50 46±n/a nM
Citation Ndubaku, COCrawford, TDChen, HBoggs, JWDrobnick, JHarris, SFJesudason, RMcNamara, ENonomiya, JSambrone, ASchmidt, SSmyczek, TVitorino, PWang, LWu, PYeung, SChen, JChen, KDing, CZWang, TXu, ZGould, SEMurray, LJYe, W Structure-Based Design of GNE-495, a Potent and Selective MAP4K4 Inhibitor with Efficacy in Retinal Angiogenesis. ACS Med Chem Lett6:913-8 (2015) 
 
Mitogen-activated protein kinase kinase kinase kinase 4
Name:Mitogen-activated protein kinase kinase kinase kinase 4
Type:Serine/threonine-protein kinase
Mol. Mass.:142114.73
Organism:Homo sapiens (Human)
Description:O95819
Residue:1239
BDBM50122688
NameBDBM50122688
Synonyms:CHEMBL3623129
TypeSmall organic molecule
Emp. Form.C18H13FN4O
Mol. Mass.320.3204
SMILESNc1ncc(C(=O)NCC#N)c2ccc(cc12)-c1cccc(F)c1