Reaction Details
TargetMitogen-activated protein kinase kinase kinase kinase 4
LigandBDBM50122743
Substrate/Competitorn/a
Meas. Tech.ChEMBL_1519920 (CHEMBL3624923)
IC50 16±n/a nM
Citation Ndubaku, COCrawford, TDChen, HBoggs, JWDrobnick, JHarris, SFJesudason, RMcNamara, ENonomiya, JSambrone, ASchmidt, SSmyczek, TVitorino, PWang, LWu, PYeung, SChen, JChen, KDing, CZWang, TXu, ZGould, SEMurray, LJYe, W Structure-Based Design of GNE-495, a Potent and Selective MAP4K4 Inhibitor with Efficacy in Retinal Angiogenesis. ACS Med Chem Lett6:913-8 (2015) 
 
Mitogen-activated protein kinase kinase kinase kinase 4
Name:Mitogen-activated protein kinase kinase kinase kinase 4
Type:Serine/threonine-protein kinase
Mol. Mass.:142114.73
Organism:Homo sapiens (Human)
Description:O95819
Residue:1239
BDBM50122743
NameBDBM50122743
Synonyms:CHEMBL3623130
TypeSmall organic molecule
Emp. Form.C19H16FN3O
Mol. Mass.321.3482
SMILESNc1ncc(C(=O)NC2CC2)c2ccc(cc12)-c1cccc(F)c1