Reaction Details
TargetBranched-chain-amino-acid aminotransferase, mitochondrial
LigandBDBM50122747
Substrate/Competitorn/a
Meas. Tech.ChEMBL_1520076 (CHEMBL3625417)
IC50 15100±n/a nM
Citation Deng, HZhou, JSundersingh, FSSummerfield, JSomers, DMesser, JASatz, ALAncellin, NArico-Muendel, CCSargent Bedard, KLBeljean, ABelyanskaya, SLBingham, RSmith, SEBoursier, ECarter, PCentrella, PAClark, MAChung, CWDavie, CPDelorey, JLDing, YFranklin, GJGrady, LCHerry, KHobbs, CKollmann, CSMorgan, BAPothier Kaushansky, LJZhou, Q Discovery, SAR, and X-ray Binding Mode Study of BCATm Inhibitors from a Novel DNA-Encoded Library. ACS Med Chem Lett6:919-24 (2015) 
 
Branched-chain-amino-acid aminotransferase, mitochondrial
Name:Branched-chain-amino-acid aminotransferase, mitochondrial
Type:PROTEIN
Mol. Mass.:44297.81
Organism:Homo sapiens (Human)
Description:ChEMBL_109874
Residue:392
BDBM50122747
NameBDBM50122747
Synonyms:CHEMBL3623146
TypeSmall organic molecule
Emp. Form.C25H24N4O5S2
Mol. Mass.524.612
SMILESCNC(=O)c1ccc(cc1O[C@@H]1CCN(C1)C(=O)c1ccc(s1)C#N)-c1ccccc1NS(C)(=O)=O