Reaction Details
TargetTyrosine-protein kinase Tec
LigandBDBM50123457
Substrate/Competitorn/a
Meas. Tech.ChEMBL_1521548 (CHEMBL3627426)
IC50 41±n/a nM
Citation Liu, QBatt, DGLippy, JSSurti, NTebben, AJMuckelbauer, JKChen, LAn, YChang, CPokross, MYang, ZWang, HBurke, JRCarter, PHTino, JA Design and synthesis of carbazole carboxamides as promising inhibitors of Bruton's tyrosine kinase (BTK) and Janus kinase 2 (JAK2). Bioorg Med Chem Lett25:4265-9 (2015) 
 
Tyrosine-protein kinase Tec
Name:Tyrosine-protein kinase Tec
Type:Protein
Mol. Mass.:73597.00
Organism:Homo sapiens (Human)
Description:n/a
Residue:631
BDBM50123457
NameBDBM50123457
Synonyms:CHEMBL3622193
TypeSmall organic molecule
Emp. Form.C34H33FN6O3
Mol. Mass.592.6626
SMILESCN(C)c1ccc(cc1)C(=O)Nc1cccc(c1F)-c1ccc(C(N)=O)c2[nH]c3cc(ccc3c12)C(=O)N1CCN(C)CC1