Reaction Details
TargetAurora kinase A
LigandBDBM50123457
Substrate/Competitorn/a
Meas. Tech.ChEMBL_1521550 (CHEMBL3627428)
IC50 493±n/a nM
Citation Liu, QBatt, DGLippy, JSSurti, NTebben, AJMuckelbauer, JKChen, LAn, YChang, CPokross, MYang, ZWang, HBurke, JRCarter, PHTino, JA Design and synthesis of carbazole carboxamides as promising inhibitors of Bruton's tyrosine kinase (BTK) and Janus kinase 2 (JAK2). Bioorg Med Chem Lett25:4265-9 (2015) 
 
Aurora kinase A
Name:Aurora kinase A
Type:Serine/threonine-protein kinase
Mol. Mass.:45830.98
Organism:Homo sapiens (Human)
Description:O14965
Residue:403
BDBM50123457
NameBDBM50123457
Synonyms:CHEMBL3622193
TypeSmall organic molecule
Emp. Form.C34H33FN6O3
Mol. Mass.592.6626
SMILESCN(C)c1ccc(cc1)C(=O)Nc1cccc(c1F)-c1ccc(C(N)=O)c2[nH]c3cc(ccc3c12)C(=O)N1CCN(C)CC1