Reaction Details
TargetTyrosine-protein kinase BTK
LigandBDBM50123547
Substrate/Competitorn/a
Meas. Tech.ChEMBL_1521543 (CHEMBL3627421)
IC50 32±n/a nM
Citation Liu, QBatt, DGLippy, JSSurti, NTebben, AJMuckelbauer, JKChen, LAn, YChang, CPokross, MYang, ZWang, HBurke, JRCarter, PHTino, JA Design and synthesis of carbazole carboxamides as promising inhibitors of Bruton's tyrosine kinase (BTK) and Janus kinase 2 (JAK2). Bioorg Med Chem Lett25:4265-9 (2015) 
 
Tyrosine-protein kinase BTK
Name:Tyrosine-protein kinase BTK
Type:Enzyme
Mol. Mass.:76289.95
Organism:Homo sapiens (Human)
Description:Q06187
Residue:659
BDBM50123547
NameBDBM50123547
Synonyms:CHEMBL3621513
TypeSmall organic molecule
Emp. Form.C26H25ClN4O2
Mol. Mass.460.955
SMILESCN1CCN(CC1)C(=O)c1ccc2c(c1)[nH]c1c(ccc(-c3cccc(Cl)c3C)c21)C(N)=O