Reaction Details
TargetTyrosine-protein kinase JAK2
LigandBDBM50123559
Substrate/Competitorn/a
Meas. Tech.ChEMBL_1521544 (CHEMBL3627422)
IC50 2.0±n/a nM
Citation Liu, QBatt, DGLippy, JSSurti, NTebben, AJMuckelbauer, JKChen, LAn, YChang, CPokross, MYang, ZWang, HBurke, JRCarter, PHTino, JA Design and synthesis of carbazole carboxamides as promising inhibitors of Bruton's tyrosine kinase (BTK) and Janus kinase 2 (JAK2). Bioorg Med Chem Lett25:4265-9 (2015) 
 
Tyrosine-protein kinase JAK2
Name:Tyrosine-protein kinase JAK2
Type:Protein
Mol. Mass.:130684.68
Organism:Homo sapiens (Human)
Description:O60674
Residue:1132
BDBM50123559
NameBDBM50123559
Synonyms:CHEMBL3622196
TypeSmall organic molecule
Emp. Form.C25H23N3O4
Mol. Mass.429.4678
SMILESCOc1ccc(cc1)-c1cc(C(N)=O)c2[nH]c3ccc(cc3c2c1)C(=O)N1CCOCC1