Reaction Details
TargetTyrosine-protein kinase JAK2
LigandBDBM50094659
Substrate/Competitorn/a
Meas. Tech.ChEMBL_1521544 (CHEMBL3627422)
IC50 2.4±n/a nM
Citation Liu, QBatt, DGLippy, JSSurti, NTebben, AJMuckelbauer, JKChen, LAn, YChang, CPokross, MYang, ZWang, HBurke, JRCarter, PHTino, JA Design and synthesis of carbazole carboxamides as promising inhibitors of Bruton's tyrosine kinase (BTK) and Janus kinase 2 (JAK2). Bioorg Med Chem Lett25:4265-9 (2015) 
 
Tyrosine-protein kinase JAK2
Name:Tyrosine-protein kinase JAK2
Type:Protein
Mol. Mass.:130684.68
Organism:Homo sapiens (Human)
Description:O60674
Residue:1132
BDBM50094659
NameBDBM50094659
Synonyms:CHEMBL3589164
TypeSmall organic molecule
Emp. Form.C24H19Cl2N3O3
Mol. Mass.468.332
SMILESNC(=O)c1cc(cc2c3cc(ccc3[nH]c12)C(=O)N1CCOCC1)-c1ccc(Cl)c(Cl)c1