Reaction Details
TargetTyrosine-protein kinase JAK2
LigandBDBM130257
Substrate/Competitorn/a
Meas. Tech.ChEMBL_1521544 (CHEMBL3627422)
IC50 1.2±n/a nM
Citation Liu, QBatt, DGLippy, JSSurti, NTebben, AJMuckelbauer, JKChen, LAn, YChang, CPokross, MYang, ZWang, HBurke, JRCarter, PHTino, JA Design and synthesis of carbazole carboxamides as promising inhibitors of Bruton's tyrosine kinase (BTK) and Janus kinase 2 (JAK2). Bioorg Med Chem Lett25:4265-9 (2015) 
 
Tyrosine-protein kinase JAK2
Name:Tyrosine-protein kinase JAK2
Type:Protein
Mol. Mass.:130684.68
Organism:Homo sapiens (Human)
Description:O60674
Residue:1132
BDBM130257
NameBDBM130257
Synonyms:US8815840, 17
TypeSmall organic molecule
Emp. Form.C25H23ClN4O2
Mol. Mass.446.929
SMILESCN1CCN(CC1)C(=O)c1ccc2[nH]c3c(cc(cc3c2c1)-c1ccc(Cl)cc1)C(N)=O