Reaction Details
TargetTyrosine-protein kinase JAK2
LigandBDBM130262
Substrate/Competitorn/a
Meas. Tech.ChEMBL_1521544 (CHEMBL3627422)
IC50 6.2±n/a nM
Citation Liu, QBatt, DGLippy, JSSurti, NTebben, AJMuckelbauer, JKChen, LAn, YChang, CPokross, MYang, ZWang, HBurke, JRCarter, PHTino, JA Design and synthesis of carbazole carboxamides as promising inhibitors of Bruton's tyrosine kinase (BTK) and Janus kinase 2 (JAK2). Bioorg Med Chem Lett25:4265-9 (2015) 
 
Tyrosine-protein kinase JAK2
Name:Tyrosine-protein kinase JAK2
Type:Protein
Mol. Mass.:130684.68
Organism:Homo sapiens (Human)
Description:O60674
Residue:1132
BDBM130262
NameBDBM130262
Synonyms:US8815840, 61
TypeSmall organic molecule
Emp. Form.C25H22Cl2N4O2
Mol. Mass.481.374
SMILESCN1CCN(CC1)C(=O)c1ccc2c(c1)[nH]c1c(cc(cc21)-c1ccc(Cl)c(Cl)c1)C(N)=O