Reaction Details
TargetAurora kinase B
LigandBDBM50123568
Substrate/Competitorn/a
Meas. Tech.ChEMBL_1521799 (CHEMBL3626659)
IC50 110±n/a nM
Citation Thoma, GVeenstra, SStrang, RBlanz, JVangrevelinghe, EBerghausen, JLee, CCZerwes, HG Orally bioavailable Syk inhibitors with activity in a rat PK/PD model. Bioorg Med Chem Lett25:4642-7 (2015) 
 
Aurora kinase B
Name:Aurora kinase B
Type:Protein
Mol. Mass.:39327.72
Organism:Homo sapiens (Human)
Description:Q96GD4
Residue:344
BDBM50123568
NameBDBM50123568
Synonyms:CHEMBL3622203
TypeSmall organic molecule
Emp. Form.C15H13F2N5O3S
Mol. Mass.381.357
SMILES[H][C@@]1(CNC(=O)O1)[C@@H](C)Oc1nc(cc2ncsc12)-c1cnn(c1)C(F)F