Reaction Details
TargetTyrosine-protein kinase SYK
LigandBDBM50123578
Substrate/Competitorn/a
Meas. Tech.ChEMBL_1521566 (CHEMBL3627444)
IC50 16±n/a nM
Citation Thoma, GVeenstra, SStrang, RBlanz, JVangrevelinghe, EBerghausen, JLee, CCZerwes, HG Orally bioavailable Syk inhibitors with activity in a rat PK/PD model. Bioorg Med Chem Lett25:4642-7 (2015) 
 
Tyrosine-protein kinase SYK
Name:Tyrosine-protein kinase SYK
Type:Enzyme
Mol. Mass.:72079.99
Organism:Homo sapiens (Human)
Description:P43405
Residue:635
BDBM50123578
NameBDBM50123578
Synonyms:CHEMBL3622209
TypeSmall organic molecule
Emp. Form.C16H16N4O3S
Mol. Mass.344.388
SMILES[H][C@@]1(CNC(=O)O1)[C@@H](C)Oc1cc(cc2nscc12)-c1cnn(C)c1