Reaction Details
TargetTyrosine-protein kinase SYK
LigandBDBM50123583
Substrate/Competitorn/a
Meas. Tech.ChEMBL_1521566 (CHEMBL3627444)
IC50 46±n/a nM
Citation Thoma, GVeenstra, SStrang, RBlanz, JVangrevelinghe, EBerghausen, JLee, CCZerwes, HG Orally bioavailable Syk inhibitors with activity in a rat PK/PD model. Bioorg Med Chem Lett25:4642-7 (2015) 
 
Tyrosine-protein kinase SYK
Name:Tyrosine-protein kinase SYK
Type:Enzyme
Mol. Mass.:72079.99
Organism:Homo sapiens (Human)
Description:P43405
Residue:635
BDBM50123583
NameBDBM50123583
Synonyms:CHEMBL3622206
TypeSmall organic molecule
Emp. Form.C17H18N4O2S
Mol. Mass.342.415
SMILES[H][C@@]1(CNC(=O)C1)[C@@H](C)Oc1cc(cc2nscc12)-c1cnn(C)c1