Reaction Details
TargetTyrosine-protein kinase SYK
LigandBDBM50123568
Substrate/Competitorn/a
Meas. Tech.ChEMBL_1521566 (CHEMBL3627444)
IC50 38±n/a nM
Citation Thoma, GVeenstra, SStrang, RBlanz, JVangrevelinghe, EBerghausen, JLee, CCZerwes, HG Orally bioavailable Syk inhibitors with activity in a rat PK/PD model. Bioorg Med Chem Lett25:4642-7 (2015) 
 
Tyrosine-protein kinase SYK
Name:Tyrosine-protein kinase SYK
Type:Enzyme
Mol. Mass.:72079.99
Organism:Homo sapiens (Human)
Description:P43405
Residue:635
BDBM50123568
NameBDBM50123568
Synonyms:CHEMBL3622203
TypeSmall organic molecule
Emp. Form.C15H13F2N5O3S
Mol. Mass.381.357
SMILES[H][C@@]1(CNC(=O)O1)[C@@H](C)Oc1nc(cc2ncsc12)-c1cnn(c1)C(F)F