Reaction Details
TargetAurora kinase A
LigandBDBM50123568
Substrate/Competitorn/a
Meas. Tech.ChEMBL_1521798 (CHEMBL3626658)
IC50 57±n/a nM
Citation Thoma, GVeenstra, SStrang, RBlanz, JVangrevelinghe, EBerghausen, JLee, CCZerwes, HG Orally bioavailable Syk inhibitors with activity in a rat PK/PD model. Bioorg Med Chem Lett25:4642-7 (2015) 
 
Aurora kinase A
Name:Aurora kinase A
Type:Serine/threonine-protein kinase
Mol. Mass.:45830.98
Organism:Homo sapiens (Human)
Description:O14965
Residue:403
BDBM50123568
NameBDBM50123568
Synonyms:CHEMBL3622203
TypeSmall organic molecule
Emp. Form.C15H13F2N5O3S
Mol. Mass.381.357
SMILES[H][C@@]1(CNC(=O)O1)[C@@H](C)Oc1nc(cc2ncsc12)-c1cnn(c1)C(F)F