Reaction Details
TargetAurora kinase A
LigandBDBM50123583
Substrate/Competitorn/a
Meas. Tech.ChEMBL_1521798 (CHEMBL3626658)
IC50 576±n/a nM
Citation Thoma, GVeenstra, SStrang, RBlanz, JVangrevelinghe, EBerghausen, JLee, CCZerwes, HG Orally bioavailable Syk inhibitors with activity in a rat PK/PD model. Bioorg Med Chem Lett25:4642-7 (2015) 
 
Aurora kinase A
Name:Aurora kinase A
Type:Serine/threonine-protein kinase
Mol. Mass.:45830.98
Organism:Homo sapiens (Human)
Description:O14965
Residue:403
BDBM50123583
NameBDBM50123583
Synonyms:CHEMBL3622206
TypeSmall organic molecule
Emp. Form.C17H18N4O2S
Mol. Mass.342.415
SMILES[H][C@@]1(CNC(=O)C1)[C@@H](C)Oc1cc(cc2nscc12)-c1cnn(C)c1