Reaction Details
TargetKappa-type opioid receptor
LigandBDBM50123599
Substrate/Competitorn/a
Meas. Tech.ChEMBL_1521810 (CHEMBL3626670)
Ki 0.500000±n/a nM
Citation Lee, DYDeng, GMa, ZXu, WYang, LLiu, JDai, RLiu-Chen, LY Synthesis and biological evaluation of 2-alkyl-2-methoxymethyl-salvinorin ethers as selectiveż-opioid receptor agonists. Bioorg Med Chem Lett25:4689-92 (2015) 
 
Kappa-type opioid receptor
Name:Kappa-type opioid receptor
Type:G Protein-Coupled Receptor (GPCR)
Mol. Mass.:42648.76
Organism:Homo sapiens (Human)
Description:P41145
Residue:380
BDBM50123599
NameBDBM50123599
Synonyms:ETORPHINE
TypeSmall organic molecule
Emp. Form.C25H33NO4
Mol. Mass.411.5338
SMILES[H][C@@]1(C[C@]23C=C[C@]1(OC)[C@@H]1Oc4c5c(C[C@H]2N(C)CC[C@@]315)ccc4O)[C@](C)(O)CCC