Reaction Details
TargetKappa-type opioid receptor
LigandBDBM50189136
Substrate/Competitorn/a
Meas. Tech.ChEMBL_1521812 (CHEMBL3626672)
EC50 0.600000±n/a nM
Citation Lee, DYDeng, GMa, ZXu, WYang, LLiu, JDai, RLiu-Chen, LY Synthesis and biological evaluation of 2-alkyl-2-methoxymethyl-salvinorin ethers as selectiveż-opioid receptor agonists. Bioorg Med Chem Lett25:4689-92 (2015) 
 
Kappa-type opioid receptor
Name:Kappa-type opioid receptor
Type:G Protein-Coupled Receptor (GPCR)
Mol. Mass.:42648.76
Organism:Homo sapiens (Human)
Description:P41145
Residue:380
BDBM50189136
NameBDBM50189136
Synonyms:CHEMBL424698 | Salvinorin B
TypeSmall organic molecule
Emp. Form.C21H26O7
Mol. Mass.390.4269
SMILESCOC(=O)[C@@H]1C[C@H](O)C(=O)[C@H]2[C@@]1(C)CC[C@H]1C(=O)O[C@@H](C[C@]21C)c1ccoc1