Reaction Details
TargetMu-type opioid receptor
LigandBDBM50123600
Substrate/Competitorn/a
Meas. Tech.ChEMBL_1521811 (CHEMBL3626671)
Ki>1000±n/a nM
Citation Lee, DYDeng, GMa, ZXu, WYang, LLiu, JDai, RLiu-Chen, LY Synthesis and biological evaluation of 2-alkyl-2-methoxymethyl-salvinorin ethers as selectiveż-opioid receptor agonists. Bioorg Med Chem Lett25:4689-92 (2015) 
 
Mu-type opioid receptor
Name:Mu-type opioid receptor
Type:G Protein-Coupled Receptor (GPCR)
Mol. Mass.:44503.11
Organism:Rattus norvegicus (rat)
Description:Competition binding assays were carried out using membrane preparations from transfected HN9.10 cells that constitutively expressed the mu opioid receptor.
Residue:398
BDBM50123600
NameBDBM50123600
Synonyms:CHEMBL3622718
TypeSmall organic molecule
Emp. Form.C27H37IO8
Mol. Mass.616.4824
SMILES[H][C@]12CC[C@@]3(C)[C@@H](C[C@](CCOCCI)(COC)C(=O)[C@]3([H])[C@@]1(C)C[C@H](OC2=O)c1ccoc1)C(=O)OC