Reaction Details
TargetRetinoic acid receptor RXR-alpha
LigandBDBM50123609
Substrate/Competitorn/a
Meas. Tech.ChEMBL_1521818 (CHEMBL3626678)
Kd 9.0±n/a nM
Citation Atigadda, VRXia, GDeshpande, AWu, LKedishvili, NSmith, CDKrontiras, HBland, KIGrubbs, CJBrouillette, WJMuccio, DD Conformationally Defined Rexinoids and Their Efficacy in the Prevention of Mammary Cancers. J Med Chem58:7763-74 (2015) 
 
Retinoic acid receptor RXR-alpha
Name:Retinoic acid receptor RXR-alpha
Type:PROTEIN
Mol. Mass.:50820.38
Organism:Homo sapiens (Human)
Description:ChEMBL_1456363
Residue:462
BDBM50123609
NameBDBM50123609
Synonyms:CHEMBL3622724
TypeSmall organic molecule
Emp. Form.C24H36O2
Mol. Mass.356.5414
SMILESCC(C)CCC1=C(CCC\C1=C/C(/C)=C\C=C\C(\C)=C\C(O)=O)C(C)C