Reaction Details
TargetRetinoic acid receptor RXR-alpha
LigandBDBM50123616
Substrate/Competitorn/a
Meas. Tech.ChEMBL_1521818 (CHEMBL3626678)
Kd 9.0±n/a nM
Citation Atigadda, VRXia, GDeshpande, AWu, LKedishvili, NSmith, CDKrontiras, HBland, KIGrubbs, CJBrouillette, WJMuccio, DD Conformationally Defined Rexinoids and Their Efficacy in the Prevention of Mammary Cancers. J Med Chem58:7763-74 (2015) 
 
Retinoic acid receptor RXR-alpha
Name:Retinoic acid receptor RXR-alpha
Type:PROTEIN
Mol. Mass.:50820.38
Organism:Homo sapiens (Human)
Description:ChEMBL_1456363
Residue:462
BDBM50123616
NameBDBM50123616
Synonyms:CHEMBL3622719
TypeSmall organic molecule
Emp. Form.C21H24O2
Mol. Mass.308.4141
SMILESC/C(/C=C/C=C(/C)\C=C1/CCCCc2ccccc12)=C\C(O)=O