Reaction Details
TargetPolyamine deacetylase HDAC10
LigandBDBM50354086
Substrate/Competitorn/a
Meas. Tech.ChEMBL_1522030 (CHEMBL3627137)
IC50 11±n/a nM
Citation Yao, YTu, ZLiao, CWang, ZLi, SYao, HLi, ZJiang, S Discovery of Novel Class I Histone Deacetylase Inhibitors with Promising in Vitro and in Vivo Antitumor Activities. J Med Chem58:7672-80 (2015) 
 
Polyamine deacetylase HDAC10
Name:Polyamine deacetylase HDAC10
Type:Chromatin regulator; hydrolase; repressor
Mol. Mass.:71431.89
Organism:Homo sapiens (Human)
Description:Q969S8
Residue:669
BDBM50354086
NameBDBM50354086
Synonyms:FK-228 ROMIDEPSIN
TypeSmall organic molecule
Emp. Form.C25H39N3O6S2
Mol. Mass.541.724
SMILESC\C=C1/NC(=O)[C@@H](CS)NC(=O)[C@H](CC(=O)C[C@H](OC(=O)[C@@H](NC1=O)C(C)C)\C=C\CCS)C(C)C