Reaction Details
TargetPolyamine deacetylase HDAC10
LigandBDBM50123620
Substrate/Competitorn/a
Meas. Tech.ChEMBL_1522030 (CHEMBL3627137)
IC50 37±n/a nM
Citation Yao, YTu, ZLiao, CWang, ZLi, SYao, HLi, ZJiang, S Discovery of Novel Class I Histone Deacetylase Inhibitors with Promising in Vitro and in Vivo Antitumor Activities. J Med Chem58:7672-80 (2015) 
 
Polyamine deacetylase HDAC10
Name:Polyamine deacetylase HDAC10
Type:Chromatin regulator; hydrolase; repressor
Mol. Mass.:71431.89
Organism:Homo sapiens (Human)
Description:Q969S8
Residue:669
BDBM50123620
NameBDBM50123620
Synonyms:CHEMBL3622729
TypeSmall organic molecule
Emp. Form.C21H28N4O5S2
Mol. Mass.480.601
SMILESC\C=C1/NC(=O)c2csc(CNC(=O)C[C@H](OC(=O)[C@@H](NC1=O)C(C)C)\C=C\CCS)n2