Reaction Details
TargetHistone deacetylase 8
LigandBDBM50123634
Substrate/Competitorn/a
Meas. Tech.ChEMBL_1522024 (CHEMBL3627131)
IC50>10000±n/a nM
Citation Yao, YTu, ZLiao, CWang, ZLi, SYao, HLi, ZJiang, S Discovery of Novel Class I Histone Deacetylase Inhibitors with Promising in Vitro and in Vivo Antitumor Activities. J Med Chem58:7672-80 (2015) 
 
Histone deacetylase 8
Name:Histone deacetylase 8
Type:Enzyme
Mol. Mass.:41749.60
Organism:Homo sapiens (Human)
Description:Q9BY41
Residue:377
BDBM50123634
NameBDBM50123634
Synonyms:CHEMBL3622731
TypeSmall organic molecule
Emp. Form.C23H30N4O6S2
Mol. Mass.522.638
SMILESC\C=C1/NC(=O)c2csc(CNC(=O)C[C@H](OC(=O)[C@@H](NC1=O)C(C)C)\C=C\CCSC(C)=O)n2