Reaction Details
TargetHistone deacetylase 4
LigandBDBM50123620
Substrate/Competitorn/a
Meas. Tech.ChEMBL_1522025 (CHEMBL3627132)
IC50>10000±n/a nM
Citation Yao, YTu, ZLiao, CWang, ZLi, SYao, HLi, ZJiang, S Discovery of Novel Class I Histone Deacetylase Inhibitors with Promising in Vitro and in Vivo Antitumor Activities. J Med Chem58:7672-80 (2015) 
 
Histone deacetylase 4
Name:Histone deacetylase 4
Type:Enzyme
Mol. Mass.:119049.39
Organism:Homo sapiens (Human)
Description:P56524
Residue:1084
BDBM50123620
NameBDBM50123620
Synonyms:CHEMBL3622729
TypeSmall organic molecule
Emp. Form.C21H28N4O5S2
Mol. Mass.480.601
SMILESC\C=C1/NC(=O)c2csc(CNC(=O)C[C@H](OC(=O)[C@@H](NC1=O)C(C)C)\C=C\CCS)n2