Reaction Details
TargetTyrosine-protein kinase Lck
LigandBDBM50123803
Substrate/Competitorn/a
Meas. Tech.ChEMBL_1519159 (CHEMBL3624352)
IC50>10000±n/a nM
Citation Lin, XDYang, HWMa, SLi, WWZhang, CHWang, WJXiang, RLi, LLYang, SY Discovery of 6-phenylimidazo[2,1-b]thiazole derivatives as a new type of FLT3 inhibitors. Bioorg Med Chem Lett25:4534-8 (2015) 
 
Tyrosine-protein kinase Lck
Name:Tyrosine-protein kinase Lck
Type:n/a
Mol. Mass.:57987.83
Organism:Homo sapiens (Human)
Description:P06239
Residue:509
BDBM50123803
NameBDBM50123803
Synonyms:CHEMBL3623375
TypeSmall organic molecule
Emp. Form.C25H31N7O3S
Mol. Mass.509.624
SMILESCN(C)CCCNC(=O)c1csc2nc(cn12)-c1ccc(NC(=O)Nc2cc(on2)C(C)(C)C)cc1