Reaction Details
TargetLIM domain kinase 1
LigandBDBM50124352
Substrate/Competitorn/a
Meas. Tech.ChEMBL_1520363 (CHEMBL3624101)
IC50 800±n/a nM
Citation Charles, MDBrookfield, JLEkwuru, TCStockley, MDunn, JRiddick, MHammonds, TTrivier, EGreenland, GWong, ACCheasty, ABoyd, SCrighton, DOlson, MF Discovery, Development, and SAR of Aminothiazoles as LIMK Inhibitors with Cellular Anti-Invasive Properties. J Med Chem58:8309-13 (2015) 
 
LIM domain kinase 1
Name:LIM domain kinase 1
Type:Enzyme Catalytic Domain
Mol. Mass.:72591.81
Organism:Homo sapiens (Human)
Description:gi_4505001
Residue:647
BDBM50124352
NameBDBM50124352
Synonyms:CHEMBL3623441
TypeSmall organic molecule
Emp. Form.C18H16ClN3OS
Mol. Mass.357.857
SMILESCC(C)C(=O)Nc1ncc(s1)-c1ccncc1-c1ccccc1Cl