Reaction Details
TargetLIM domain kinase 1
LigandBDBM50124353
Substrate/Competitorn/a
Meas. Tech.ChEMBL_1520363 (CHEMBL3624101)
IC50 2000±n/a nM
Citation Charles, MDBrookfield, JLEkwuru, TCStockley, MDunn, JRiddick, MHammonds, TTrivier, EGreenland, GWong, ACCheasty, ABoyd, SCrighton, DOlson, MF Discovery, Development, and SAR of Aminothiazoles as LIMK Inhibitors with Cellular Anti-Invasive Properties. J Med Chem58:8309-13 (2015) 
 
LIM domain kinase 1
Name:LIM domain kinase 1
Type:Enzyme Catalytic Domain
Mol. Mass.:72591.81
Organism:Homo sapiens (Human)
Description:gi_4505001
Residue:647
BDBM50124353
NameBDBM50124353
Synonyms:CHEMBL3623443
TypeSmall organic molecule
Emp. Form.C20H18F3N3O2S
Mol. Mass.421.436
SMILESCOc1ccc(-c2cnccc2-c2cnc(NC(=O)C(C)C)s2)c(c1)C(F)(F)F