Reaction Details
TargetLIM domain kinase 1
LigandBDBM50124363
Substrate/Competitorn/a
Meas. Tech.ChEMBL_1520362 (CHEMBL3624100)
IC50 13±n/a nM
Citation Charles, MDBrookfield, JLEkwuru, TCStockley, MDunn, JRiddick, MHammonds, TTrivier, EGreenland, GWong, ACCheasty, ABoyd, SCrighton, DOlson, MF Discovery, Development, and SAR of Aminothiazoles as LIMK Inhibitors with Cellular Anti-Invasive Properties. J Med Chem58:8309-13 (2015) 
 
LIM domain kinase 1
Name:LIM domain kinase 1
Type:Enzyme Catalytic Domain
Mol. Mass.:72591.81
Organism:Homo sapiens (Human)
Description:gi_4505001
Residue:647
BDBM50124363
NameBDBM50124363
Synonyms:CHEMBL3622874
TypeSmall organic molecule
Emp. Form.C19H18F3N3OS
Mol. Mass.393.426
SMILESCCCNc1ncc(s1)-c1ccncc1-c1ccc(OC)cc1C(F)(F)F