Reaction Details
TargetLIM domain kinase 1
LigandBDBM50124362
Substrate/Competitorn/a
Meas. Tech.ChEMBL_1520363 (CHEMBL3624101)
IC50 2200±n/a nM
Citation Charles, MDBrookfield, JLEkwuru, TCStockley, MDunn, JRiddick, MHammonds, TTrivier, EGreenland, GWong, ACCheasty, ABoyd, SCrighton, DOlson, MF Discovery, Development, and SAR of Aminothiazoles as LIMK Inhibitors with Cellular Anti-Invasive Properties. J Med Chem58:8309-13 (2015) 
 
LIM domain kinase 1
Name:LIM domain kinase 1
Type:Enzyme Catalytic Domain
Mol. Mass.:72591.81
Organism:Homo sapiens (Human)
Description:gi_4505001
Residue:647
BDBM50124362
NameBDBM50124362
Synonyms:CHEMBL3622873
TypeSmall organic molecule
Emp. Form.C18H16F3N3S
Mol. Mass.363.4
SMILESCCCNc1ncc(s1)-c1ccncc1-c1ccccc1C(F)(F)F